{"text_format":"2","workbook":"xlsx","n_sheets":2,"sheets":["BVNW Meldeliste Bezirk-Land","Daten"],"not_rendered":{"charts":0,"images":1,"macros":0,"external_links":0,"defined_names":1,"comments":0,"pivot_tables":0},"unopened":[],"bounds":{"document_bytes":16777216,"sheet_cells":100000,"run_cost":"one","rows_first":2000,"rows_last":500,"rows_between":2000,"halvings":0,"cell_chars":16384,"cell_head_chars":4096},"cells_cut":0,"cells_raw":0,"read":"whole","date_system":"1900"}

{"sheet":"BVNW Meldeliste Bezirk-Land","index":0,"n_rows":146,"n_cols":11,"rows_kept":146,"cut":false,"hidden":false,"merged":[[6,8,6,9],[8,8,8,9],[9,4,9,5],[10,4,10,5],[9,6,9,9],[10,6,10,9],[7,4,7,9],[2,3,2,5],[1,3,1,8],[3,6,3,9],[5,4,5,9],[3,3,3,4],[5,0,5,3],[0,3,0,6],[7,0,7,3],[12,0,12,3],[14,0,14,3],[9,0,10,3],[48,1,48,8],[47,1,47,2],[15,8,15,9],[11,8,11,9],[13,8,13,9],[12,4,12,9],[14,4,14,9]]}
[null,null,"Anmeldung zur:","BVNW offenen Landesmeisterschaft",{"$nulls":4},2025]
[null,null,null,"BVNW Land -Runde im Freien-"]
[]
[null,null,"Datum:","21.06.2025 / 22.06.2025",null,"Ort:","Hammer SC 08\nHubert-Westermeier-Straße 5, 55069 Hamm"]
[]
["offizieller Name des Bogensportvereins:"]
[{"$nulls":8},"(gem. Vereinsregister)"]
["offizielle vollst. Anschrift des\nBogensportvereins eintragen:"]
[{"$nulls":8},"(gem. Vereinsregister)"]
["offizielle E-Mailadressen für Startgelder\nund Rechnungen des Bogensportvereins\neintragen:",null,null,null,"Geschäftsstelle:"]
[{"$nulls":4},"Kassenwart:"]
[]
["vollst.  Name des/der Anmelders/in\neintragen:"]
[]
["E-Mail des/der Anmelders/In:"]
[]
[]
["Lfd\nNr.","Mitgliedsnummer im DBSV\n10/999/99999","Name\n\nZ.B. Mustermann","Vorname\n\nMax","m\n/\nw","Jahrgang\n\n1999","Verein","Bogenart\n\nRC","Altersklasse\n\nHerren Ü50","Rollifahrer*in"]
[1,{"$nulls":9},{"$f":"IF($E19=\"m\",VLOOKUP($I$1-$F19,Daten!$F$3:$H$95,2,FALSE),VLOOKUP($I$1-$F19,Daten!$F$3:$H$95,3,FALSE))","v":{"$error":"#N/A"}}]
[{"$f":"IF(ISTEXT(C19),A19+1,\"\")","v":""},{"$nulls":9},{"$f":"IF($E20=\"m\",VLOOKUP($I$1-$F20,Daten!$F$3:$H$95,2,FALSE),VLOOKUP($I$1-$F20,Daten!$F$3:$H$95,3,FALSE))","v":{"$error":"#N/A"}}]
[{"$f":"IF(ISTEXT(C20),A20+1,\"\")","v":""},{"$nulls":9},{"$f":"IF($E21=\"m\",VLOOKUP($I$1-$F21,Daten!$F$3:$H$95,2,FALSE),VLOOKUP($I$1-$F21,Daten!$F$3:$H$95,3,FALSE))","v":{"$error":"#N/A"}}]
["",{"$nulls":9},{"$f":"IF($E22=\"m\",VLOOKUP($I$1-$F22,Daten!$F$3:$H$95,2,FALSE),VLOOKUP($I$1-$F22,Daten!$F$3:$H$95,3,FALSE))","v":{"$error":"#N/A"}}]
["",{"$nulls":9},{"$f":"IF($E23=\"m\",VLOOKUP($I$1-$F23,Daten!$F$3:$H$95,2,FALSE),VLOOKUP($I$1-$F23,Daten!$F$3:$H$95,3,FALSE))","v":{"$error":"#N/A"}}]
["",{"$nulls":9},{"$f":"IF($E24=\"m\",VLOOKUP($I$1-$F24,Daten!$F$3:$H$95,2,FALSE),VLOOKUP($I$1-$F24,Daten!$F$3:$H$95,3,FALSE))","v":{"$error":"#N/A"}}]
["",{"$nulls":9},{"$f":"IF($E25=\"m\",VLOOKUP($I$1-$F25,Daten!$F$3:$H$95,2,FALSE),VLOOKUP($I$1-$F25,Daten!$F$3:$H$95,3,FALSE))","v":{"$error":"#N/A"}}]
["",{"$nulls":9},{"$f":"IF($E26=\"m\",VLOOKUP($I$1-$F26,Daten!$F$3:$H$95,2,FALSE),VLOOKUP($I$1-$F26,Daten!$F$3:$H$95,3,FALSE))","v":{"$error":"#N/A"}}]
["",{"$nulls":9},{"$f":"IF($E27=\"m\",VLOOKUP($I$1-$F27,Daten!$F$3:$H$95,2,FALSE),VLOOKUP($I$1-$F27,Daten!$F$3:$H$95,3,FALSE))","v":{"$error":"#N/A"}}]
["",{"$nulls":9},{"$f":"IF($E28=\"m\",VLOOKUP($I$1-$F28,Daten!$F$3:$H$95,2,FALSE),VLOOKUP($I$1-$F28,Daten!$F$3:$H$95,3,FALSE))","v":{"$error":"#N/A"}}]
["",{"$nulls":9},{"$f":"IF($E29=\"m\",VLOOKUP($I$1-$F29,Daten!$F$3:$H$95,2,FALSE),VLOOKUP($I$1-$F29,Daten!$F$3:$H$95,3,FALSE))","v":{"$error":"#N/A"}}]
["",{"$nulls":9},{"$f":"IF($E30=\"m\",VLOOKUP($I$1-$F30,Daten!$F$3:$H$95,2,FALSE),VLOOKUP($I$1-$F30,Daten!$F$3:$H$95,3,FALSE))","v":{"$error":"#N/A"}}]
["",{"$nulls":9},{"$f":"IF($E31=\"m\",VLOOKUP($I$1-$F31,Daten!$F$3:$H$95,2,FALSE),VLOOKUP($I$1-$F31,Daten!$F$3:$H$95,3,FALSE))","v":{"$error":"#N/A"}}]
["",{"$nulls":9},{"$f":"IF($E32=\"m\",VLOOKUP($I$1-$F32,Daten!$F$3:$H$95,2,FALSE),VLOOKUP($I$1-$F32,Daten!$F$3:$H$95,3,FALSE))","v":{"$error":"#N/A"}}]
["",{"$nulls":9},{"$f":"IF($E33=\"m\",VLOOKUP($I$1-$F33,Daten!$F$3:$H$95,2,FALSE),VLOOKUP($I$1-$F33,Daten!$F$3:$H$95,3,FALSE))","v":{"$error":"#N/A"}}]
["",{"$nulls":9},{"$f":"IF($E34=\"m\",VLOOKUP($I$1-$F34,Daten!$F$3:$H$95,2,FALSE),VLOOKUP($I$1-$F34,Daten!$F$3:$H$95,3,FALSE))","v":{"$error":"#N/A"}}]
["",{"$nulls":9},{"$f":"IF($E35=\"m\",VLOOKUP($I$1-$F35,Daten!$F$3:$H$95,2,FALSE),VLOOKUP($I$1-$F35,Daten!$F$3:$H$95,3,FALSE))","v":{"$error":"#N/A"}}]
["",{"$nulls":9},{"$f":"IF($E36=\"m\",VLOOKUP($I$1-$F36,Daten!$F$3:$H$95,2,FALSE),VLOOKUP($I$1-$F36,Daten!$F$3:$H$95,3,FALSE))","v":{"$error":"#N/A"}}]
["",{"$nulls":9},{"$f":"IF($E37=\"m\",VLOOKUP($I$1-$F37,Daten!$F$3:$H$95,2,FALSE),VLOOKUP($I$1-$F37,Daten!$F$3:$H$95,3,FALSE))","v":{"$error":"#N/A"}}]
["",{"$nulls":9},{"$f":"IF($E38=\"m\",VLOOKUP($I$1-$F38,Daten!$F$3:$H$95,2,FALSE),VLOOKUP($I$1-$F38,Daten!$F$3:$H$95,3,FALSE))","v":{"$error":"#N/A"}}]
["",{"$nulls":9},{"$f":"IF($E39=\"m\",VLOOKUP($I$1-$F39,Daten!$F$3:$H$95,2,FALSE),VLOOKUP($I$1-$F39,Daten!$F$3:$H$95,3,FALSE))","v":{"$error":"#N/A"}}]
["",{"$nulls":9},{"$f":"IF($E40=\"m\",VLOOKUP($I$1-$F40,Daten!$F$3:$H$95,2,FALSE),VLOOKUP($I$1-$F40,Daten!$F$3:$H$95,3,FALSE))","v":{"$error":"#N/A"}}]
["",{"$nulls":9},{"$f":"IF($E41=\"m\",VLOOKUP($I$1-$F41,Daten!$F$3:$H$95,2,FALSE),VLOOKUP($I$1-$F41,Daten!$F$3:$H$95,3,FALSE))","v":{"$error":"#N/A"}}]
["",{"$nulls":9},{"$f":"IF($E42=\"m\",VLOOKUP($I$1-$F42,Daten!$F$3:$H$95,2,FALSE),VLOOKUP($I$1-$F42,Daten!$F$3:$H$95,3,FALSE))","v":{"$error":"#N/A"}}]
["",{"$nulls":9},{"$f":"IF($E43=\"m\",VLOOKUP($I$1-$F43,Daten!$F$3:$H$95,2,FALSE),VLOOKUP($I$1-$F43,Daten!$F$3:$H$95,3,FALSE))","v":{"$error":"#N/A"}}]
["",{"$nulls":9},{"$f":"IF($E44=\"m\",VLOOKUP($I$1-$F44,Daten!$F$3:$H$95,2,FALSE),VLOOKUP($I$1-$F44,Daten!$F$3:$H$95,3,FALSE))","v":{"$error":"#N/A"}}]
["",{"$nulls":9},{"$f":"IF($E45=\"m\",VLOOKUP($I$1-$F45,Daten!$F$3:$H$95,2,FALSE),VLOOKUP($I$1-$F45,Daten!$F$3:$H$95,3,FALSE))","v":{"$error":"#N/A"}}]
["",{"$nulls":9},{"$f":"IF($E46=\"m\",VLOOKUP($I$1-$F46,Daten!$F$3:$H$95,2,FALSE),VLOOKUP($I$1-$F46,Daten!$F$3:$H$95,3,FALSE))","v":{"$error":"#N/A"}}]
[{"$nulls":9},"eingegangen:"]
[null,"Bemerkungen eintragen:"]
[null,"Text eingeben:"]
{"$rows_empty":26}
[{"$f":"IF(ISTEXT(C75),A75+1,\"\")","v":""}]
[""]
[""]
[""]
[""]
[{"$f":"IF(ISTEXT(C80),A80+1,\"\")","v":""}]
[""]
[""]
[""]
[""]
[""]
[""]
[""]
[""]
[""]
[""]
[""]
[""]
[""]
[""]
[""]
[""]
[""]
[""]
[""]
[""]
[""]
[""]
[""]
[""]
[""]
[""]
[""]
[""]
[""]
[""]
[""]
[{"$f":"IF(ISTEXT(C112),A112+1,\"\")","v":""}]
[""]
[""]
[""]
[""]
[""]
[""]
[""]
[""]
[""]
[""]
[""]
[""]
[""]
[""]
[""]
[""]
[""]
[""]
[""]
[""]
[""]
[""]
[""]
[""]
[""]
[""]
[""]
[""]
[""]
[""]
[""]
[""]
[""]

{"sheet":"Daten","index":1,"n_rows":95,"n_cols":8,"rows_kept":95,"cut":false,"hidden":true,"merged":[[0,5,0,7]]}
["BVNW Meisterschaften:","Bezirke:","Bezirke:","Bogenklassen:","Altersklassen:","Altersklassen aufgeschlüsselt"]
["*auswählen*","*auswählen*","*auswählen*","RC","U10m","Alter","männlich","weiblich"]
["BVNW Bezirk -Hallenrunde-",1,"BVNW-Bezirk:","CU","U10w",8,"U10m","U10w"]
["BVNW Bezirk -Runde im Freien-",2,"BVNW-Land:","CB","U12m",9,"U10m","U10w"]
["BVNW Land -Hallenrunde-",5,null,"BB","U12w",10,"U10m","U10w"]
["BVNW Land -3D Wald- u. Jagdrunde-",6,"Meisterschaften:","JB","U15m",11,"U12m","U12w"]
["BVNW Land -Runde im Freien-",7,"*auswählen*","LB","U15w",12,"U12m","U12w"]
["BVNW Land -Feldrunde-",null,"BVNW Bezirksmeisterschaft","PB","U18m",13,"U15m","U15w"]
["BVNW Land -Waldrunde-","NW","BVNW Landesmeisterschaft","KB","U18w",14,"U15m","U15w"]
["BVNW Land -Feld-/Waldrunde-","NW & NI","BVNW offenen Landesmeisterschaft",null,"Damen",15,"U15m","U15w"]
[{"$nulls":4},"Herren",16,"U18m","U18w"]
[{"$nulls":4},"Damen Ü50",17,"U18m","U18w"]
[{"$nulls":4},"Herren Ü50",18,"U18m","U18w"]
[{"$nulls":4},"Damen Ü65",19,"Herren","Damen"]
[{"$nulls":4},"Herren Ü65",20,"Herren","Damen"]
[{"$nulls":5},21,"Herren","Damen"]
[{"$nulls":5},22,"Herren","Damen"]
[{"$nulls":5},23,"Herren","Damen"]
[{"$nulls":5},24,"Herren","Damen"]
[{"$nulls":5},25,"Herren","Damen"]
[{"$nulls":5},26,"Herren","Damen"]
[{"$nulls":5},27,"Herren","Damen"]
[{"$nulls":5},28,"Herren","Damen"]
[{"$nulls":5},29,"Herren","Damen"]
[{"$nulls":5},30,"Herren","Damen"]
[{"$nulls":5},31,"Herren","Damen"]
[{"$nulls":5},32,"Herren","Damen"]
[{"$nulls":5},33,"Herren","Damen"]
[{"$nulls":5},34,"Herren","Damen"]
[{"$nulls":5},35,"Herren","Damen"]
[{"$nulls":5},36,"Herren","Damen"]
[{"$nulls":5},37,"Herren","Damen"]
[{"$nulls":5},38,"Herren","Damen"]
[{"$nulls":5},39,"Herren","Damen"]
[{"$nulls":5},40,"Herren","Damen"]
[{"$nulls":5},41,"Herren","Damen"]
[{"$nulls":5},42,"Herren","Damen"]
[{"$nulls":5},43,"Herren","Damen"]
[{"$nulls":5},44,"Herren","Damen"]
[{"$nulls":5},45,"Herren","Damen"]
[{"$nulls":5},46,"Herren","Damen"]
[{"$nulls":5},47,"Herren","Damen"]
[{"$nulls":5},48,"Herren","Damen"]
[{"$nulls":5},49,"Herren","Damen"]
[{"$nulls":5},50,"Herren","Damen"]
[{"$nulls":5},51,"Herren Ü50","Damen Ü50"]
[{"$nulls":5},52,"Herren Ü50","Damen Ü50"]
[{"$nulls":5},53,"Herren Ü50","Damen Ü50"]
[{"$nulls":5},54,"Herren Ü50","Damen Ü50"]
[{"$nulls":5},55,"Herren Ü50","Damen Ü50"]
[{"$nulls":5},56,"Herren Ü50","Damen Ü50"]
[{"$nulls":5},57,"Herren Ü50","Damen Ü50"]
[{"$nulls":5},58,"Herren Ü50","Damen Ü50"]
[{"$nulls":5},59,"Herren Ü50","Damen Ü50"]
[{"$nulls":5},60,"Herren Ü50","Damen Ü50"]
[{"$nulls":5},61,"Herren Ü50","Damen Ü50"]
[{"$nulls":5},62,"Herren Ü50","Damen Ü50"]
[{"$nulls":5},63,"Herren Ü50","Damen Ü50"]
[{"$nulls":5},64,"Herren Ü50","Damen Ü50"]
[{"$nulls":5},65,"Herren Ü50","Damen Ü50"]
[{"$nulls":5},66,"Herren Ü65","Damen Ü65"]
[{"$nulls":5},67,"Herren Ü65","Damen Ü65"]
[{"$nulls":5},68,"Herren Ü65","Damen Ü65"]
[{"$nulls":5},69,"Herren Ü65","Damen Ü65"]
[{"$nulls":5},70,"Herren Ü65","Damen Ü65"]
[{"$nulls":5},71,"Herren Ü65","Damen Ü65"]
[{"$nulls":5},72,"Herren Ü65","Damen Ü65"]
[{"$nulls":5},73,"Herren Ü65","Damen Ü65"]
[{"$nulls":5},74,"Herren Ü65","Damen Ü65"]
[{"$nulls":5},75,"Herren Ü65","Damen Ü65"]
[{"$nulls":5},76,"Herren Ü65","Damen Ü65"]
[{"$nulls":5},77,"Herren Ü65","Damen Ü65"]
[{"$nulls":5},78,"Herren Ü65","Damen Ü65"]
[{"$nulls":5},79,"Herren Ü65","Damen Ü65"]
[{"$nulls":5},80,"Herren Ü65","Damen Ü65"]
[{"$nulls":5},81,"Herren Ü65","Damen Ü65"]
[{"$nulls":5},82,"Herren Ü65","Damen Ü65"]
[{"$nulls":5},83,"Herren Ü65","Damen Ü65"]
[{"$nulls":5},84,"Herren Ü65","Damen Ü65"]
[{"$nulls":5},85,"Herren Ü65","Damen Ü65"]
[{"$nulls":5},86,"Herren Ü65","Damen Ü65"]
[{"$nulls":5},87,"Herren Ü65","Damen Ü65"]
[{"$nulls":5},88,"Herren Ü65","Damen Ü65"]
[{"$nulls":5},89,"Herren Ü65","Damen Ü65"]
[{"$nulls":5},90,"Herren Ü65","Damen Ü65"]
[{"$nulls":5},91,"Herren Ü65","Damen Ü65"]
[{"$nulls":5},92,"Herren Ü65","Damen Ü65"]
[{"$nulls":5},93,"Herren Ü65","Damen Ü65"]
[{"$nulls":5},94,"Herren Ü65","Damen Ü65"]
[{"$nulls":5},95,"Herren Ü65","Damen Ü65"]
[{"$nulls":5},96,"Herren Ü65","Damen Ü65"]
[{"$nulls":5},97,"Herren Ü65","Damen Ü65"]
[{"$nulls":5},98,"Herren Ü65","Damen Ü65"]
[{"$nulls":5},99,"Herren Ü65","Damen Ü65"]
[{"$nulls":5},100,"Herren Ü65","Damen Ü65"]