{"text_format":"2","workbook":"xlsx","n_sheets":2,"sheets":["BVNW Meldeliste Bezirk-Land","Daten"],"not_rendered":{"charts":0,"images":1,"macros":0,"external_links":0,"defined_names":1,"comments":0,"pivot_tables":0},"unopened":[],"bounds":{"document_bytes":16777216,"sheet_cells":100000,"run_cost":"one","rows_first":2000,"rows_last":500,"rows_between":2000,"halvings":0,"cell_chars":16384,"cell_head_chars":4096},"cells_cut":0,"cells_raw":0,"read":"whole","date_system":"1900"}

{"sheet":"BVNW Meldeliste Bezirk-Land","index":0,"n_rows":146,"n_cols":10,"rows_kept":146,"cut":false,"hidden":false,"merged":[[15,4,15,8],[11,4,11,8],[48,1,48,7],[13,4,13,8],[14,3,14,8],[5,0,5,2],[0,2,0,3],[2,2,2,3],[0,7,0,8],[3,4,3,8],[1,2,1,4],[6,4,6,8],[8,4,8,8],[5,3,5,8],[7,3,7,8],[12,3,12,8],[9,4,9,8],[7,0,7,2],[12,0,12,2],[14,0,14,2],[9,0,10,2],[10,4,10,8]]}
[null,"Anmeldung zur:","BVNW Landesmeisterschaft",null,2025,null,"Länder:","NI & NW & SH"]
[null,null,"-FeWa-Runde-"]
[]
[null,"Datum:","2025-06-14","Ort:","SV Gustedt, Dorfstraße 7, 38274 Gustedt\nKoordinaten: 52.10072, 10.30819"]
[]
["offizieller Name des Bogensportvereins:"]
[{"$nulls":4},"(gem. Vereinsregister)"]
["offizielle vollst. Anschrift des\nBogensportvereins eintragen:"]
[{"$nulls":4},"(gem. Vereinsregister)"]
["offizielle E-Mailadressen für Startgelder\nund Rechnungen des Bogensportvereins\neintragen:",null,null,"Geschäftsstelle:"]
[null,null,null,"Kassenwart:"]
[]
["vollst.  Name des/der Anmelders/in\neintragen:"]
[]
["E-Mail des/der Anmelders/In:"]
[]
[]
["Lfd\nNr.","Name\n\nZ.B. Mustermann","Vorname\n\nMax","Jahrgang\n\n1999","Altersklasse\n\nHerren Ü50","Bogenart\n\nRC","Mitgliedsnummer im DBSV\n10/999/99999","m\n/\nw","Bemerkung:"]
[1,{"$nulls":8},{"$f":"IF($H19=\"m\",VLOOKUP($E$1-$D19,Daten!$F$3:$H$95,2,FALSE),VLOOKUP($E$1-$D19,Daten!$F$3:$H$95,3,FALSE))","v":{"$error":"#N/A"}}]
[{"$f":"IF(ISTEXT(B19),A19+1,\"\")","v":""},{"$nulls":8},{"$f":"IF($H20=\"m\",VLOOKUP($E$1-$D20,Daten!$F$3:$H$95,2,FALSE),VLOOKUP($E$1-$D20,Daten!$F$3:$H$95,3,FALSE))","v":{"$error":"#N/A"}}]
[{"$f":"IF(ISTEXT(B20),A20+1,\"\")","v":""},{"$nulls":8},{"$f":"IF($H21=\"m\",VLOOKUP($E$1-$D21,Daten!$F$3:$H$95,2,FALSE),VLOOKUP($E$1-$D21,Daten!$F$3:$H$95,3,FALSE))","v":{"$error":"#N/A"}}]
["",{"$nulls":8},{"$f":"IF($H22=\"m\",VLOOKUP($E$1-$D22,Daten!$F$3:$H$95,2,FALSE),VLOOKUP($E$1-$D22,Daten!$F$3:$H$95,3,FALSE))","v":{"$error":"#N/A"}}]
["",{"$nulls":8},{"$f":"IF($H23=\"m\",VLOOKUP($E$1-$D23,Daten!$F$3:$H$95,2,FALSE),VLOOKUP($E$1-$D23,Daten!$F$3:$H$95,3,FALSE))","v":{"$error":"#N/A"}}]
["",{"$nulls":8},{"$f":"IF($H24=\"m\",VLOOKUP($E$1-$D24,Daten!$F$3:$H$95,2,FALSE),VLOOKUP($E$1-$D24,Daten!$F$3:$H$95,3,FALSE))","v":{"$error":"#N/A"}}]
["",{"$nulls":8},{"$f":"IF($H25=\"m\",VLOOKUP($E$1-$D25,Daten!$F$3:$H$95,2,FALSE),VLOOKUP($E$1-$D25,Daten!$F$3:$H$95,3,FALSE))","v":{"$error":"#N/A"}}]
["",{"$nulls":8},{"$f":"IF($H26=\"m\",VLOOKUP($E$1-$D26,Daten!$F$3:$H$95,2,FALSE),VLOOKUP($E$1-$D26,Daten!$F$3:$H$95,3,FALSE))","v":{"$error":"#N/A"}}]
["",{"$nulls":8},{"$f":"IF($H27=\"m\",VLOOKUP($E$1-$D27,Daten!$F$3:$H$95,2,FALSE),VLOOKUP($E$1-$D27,Daten!$F$3:$H$95,3,FALSE))","v":{"$error":"#N/A"}}]
["",{"$nulls":8},{"$f":"IF($H28=\"m\",VLOOKUP($E$1-$D28,Daten!$F$3:$H$95,2,FALSE),VLOOKUP($E$1-$D28,Daten!$F$3:$H$95,3,FALSE))","v":{"$error":"#N/A"}}]
["",{"$nulls":8},{"$f":"IF($H29=\"m\",VLOOKUP($E$1-$D29,Daten!$F$3:$H$95,2,FALSE),VLOOKUP($E$1-$D29,Daten!$F$3:$H$95,3,FALSE))","v":{"$error":"#N/A"}}]
["",{"$nulls":8},{"$f":"IF($H30=\"m\",VLOOKUP($E$1-$D30,Daten!$F$3:$H$95,2,FALSE),VLOOKUP($E$1-$D30,Daten!$F$3:$H$95,3,FALSE))","v":{"$error":"#N/A"}}]
["",{"$nulls":8},{"$f":"IF($H31=\"m\",VLOOKUP($E$1-$D31,Daten!$F$3:$H$95,2,FALSE),VLOOKUP($E$1-$D31,Daten!$F$3:$H$95,3,FALSE))","v":{"$error":"#N/A"}}]
["",{"$nulls":8},{"$f":"IF($H32=\"m\",VLOOKUP($E$1-$D32,Daten!$F$3:$H$95,2,FALSE),VLOOKUP($E$1-$D32,Daten!$F$3:$H$95,3,FALSE))","v":{"$error":"#N/A"}}]
["",{"$nulls":8},{"$f":"IF($H33=\"m\",VLOOKUP($E$1-$D33,Daten!$F$3:$H$95,2,FALSE),VLOOKUP($E$1-$D33,Daten!$F$3:$H$95,3,FALSE))","v":{"$error":"#N/A"}}]
["",{"$nulls":8},{"$f":"IF($H34=\"m\",VLOOKUP($E$1-$D34,Daten!$F$3:$H$95,2,FALSE),VLOOKUP($E$1-$D34,Daten!$F$3:$H$95,3,FALSE))","v":{"$error":"#N/A"}}]
["",{"$nulls":8},{"$f":"IF($H35=\"m\",VLOOKUP($E$1-$D35,Daten!$F$3:$H$95,2,FALSE),VLOOKUP($E$1-$D35,Daten!$F$3:$H$95,3,FALSE))","v":{"$error":"#N/A"}}]
["",{"$nulls":8},{"$f":"IF($H36=\"m\",VLOOKUP($E$1-$D36,Daten!$F$3:$H$95,2,FALSE),VLOOKUP($E$1-$D36,Daten!$F$3:$H$95,3,FALSE))","v":{"$error":"#N/A"}}]
["",{"$nulls":8},{"$f":"IF($H37=\"m\",VLOOKUP($E$1-$D37,Daten!$F$3:$H$95,2,FALSE),VLOOKUP($E$1-$D37,Daten!$F$3:$H$95,3,FALSE))","v":{"$error":"#N/A"}}]
["",{"$nulls":8},{"$f":"IF($H38=\"m\",VLOOKUP($E$1-$D38,Daten!$F$3:$H$95,2,FALSE),VLOOKUP($E$1-$D38,Daten!$F$3:$H$95,3,FALSE))","v":{"$error":"#N/A"}}]
["",{"$nulls":8},{"$f":"IF($H39=\"m\",VLOOKUP($E$1-$D39,Daten!$F$3:$H$95,2,FALSE),VLOOKUP($E$1-$D39,Daten!$F$3:$H$95,3,FALSE))","v":{"$error":"#N/A"}}]
["",{"$nulls":8},{"$f":"IF($H40=\"m\",VLOOKUP($E$1-$D40,Daten!$F$3:$H$95,2,FALSE),VLOOKUP($E$1-$D40,Daten!$F$3:$H$95,3,FALSE))","v":{"$error":"#N/A"}}]
["",{"$nulls":8},{"$f":"IF($H41=\"m\",VLOOKUP($E$1-$D41,Daten!$F$3:$H$95,2,FALSE),VLOOKUP($E$1-$D41,Daten!$F$3:$H$95,3,FALSE))","v":{"$error":"#N/A"}}]
["",{"$nulls":8},{"$f":"IF($H42=\"m\",VLOOKUP($E$1-$D42,Daten!$F$3:$H$95,2,FALSE),VLOOKUP($E$1-$D42,Daten!$F$3:$H$95,3,FALSE))","v":{"$error":"#N/A"}}]
["",{"$nulls":8},{"$f":"IF($H43=\"m\",VLOOKUP($E$1-$D43,Daten!$F$3:$H$95,2,FALSE),VLOOKUP($E$1-$D43,Daten!$F$3:$H$95,3,FALSE))","v":{"$error":"#N/A"}}]
["",{"$nulls":8},{"$f":"IF($H44=\"m\",VLOOKUP($E$1-$D44,Daten!$F$3:$H$95,2,FALSE),VLOOKUP($E$1-$D44,Daten!$F$3:$H$95,3,FALSE))","v":{"$error":"#N/A"}}]
["",{"$nulls":8},{"$f":"IF($H45=\"m\",VLOOKUP($E$1-$D45,Daten!$F$3:$H$95,2,FALSE),VLOOKUP($E$1-$D45,Daten!$F$3:$H$95,3,FALSE))","v":{"$error":"#N/A"}}]
["",{"$nulls":8},{"$f":"IF($H46=\"m\",VLOOKUP($E$1-$D46,Daten!$F$3:$H$95,2,FALSE),VLOOKUP($E$1-$D46,Daten!$F$3:$H$95,3,FALSE))","v":{"$error":"#N/A"}}]
[{"$nulls":8},"eingegangen:"]
[null,"Bemerkungen eintragen:"]
[null,"Text eingeben:"]
{"$rows_empty":26}
[{"$f":"IF(ISTEXT(B75),A75+1,\"\")","v":""}]
[""]
[""]
[""]
[""]
[{"$f":"IF(ISTEXT(B80),A80+1,\"\")","v":""}]
[""]
[""]
[""]
[""]
[""]
[""]
[""]
[""]
[""]
[""]
[""]
[""]
[""]
[""]
[""]
[""]
[""]
[""]
[""]
[""]
[""]
[""]
[""]
[""]
[""]
[""]
[""]
[""]
[""]
[""]
[""]
[{"$f":"IF(ISTEXT(B112),A112+1,\"\")","v":""}]
[""]
[""]
[""]
[""]
[""]
[""]
[""]
[""]
[""]
[""]
[""]
[""]
[""]
[""]
[""]
[""]
[""]
[""]
[""]
[""]
[""]
[""]
[""]
[""]
[""]
[""]
[""]
[""]
[""]
[""]
[""]
[""]
[""]

{"sheet":"Daten","index":1,"n_rows":95,"n_cols":8,"rows_kept":95,"cut":false,"hidden":true,"merged":[]}
["BVNW Meisterschaften:","Bezirke:","Bezirke:","Bogenklassen:","Altersklassen:","Altersklassen"]
["*auswählen*","*auswählen*","*auswählen*","RC","U10m","Alter","männlich","weiblich"]
[{"$f":"\"-Hallenrunde-\"","v":"-Hallenrunde-"},null,"BVNW-Bezirk:","CU","U10w",8,"U10m","U10w"]
[{"$f":"\"-Runde im Freien-\"","v":"-Runde im Freien-"},"1 & 2","BVNW-Land:","CB","U12m",9,"U10m","U10w"]
[{"$f":"\" -3D Wald- u. Jagdrunde-\"","v":" -3D Wald- u. Jagdrunde-"},5,"Länder:","BB","U12w",10,"U10m","U10w"]
[{"$f":"\" -Feldrunde-\"","v":" -Feldrunde-"},6,"Meisterschaften:","JB","U15m",11,"U12m","U12w"]
[{"$f":"\"-Waldrunde-\"","v":"-Waldrunde-"},7,"*auswählen*","LB","U15w",12,"U12m","U12w"]
[{"$f":"\"-FeWa-Runde-\"","v":"-FeWa-Runde-"},"6 & 7","BVNW Bezirksmeisterschaft","PB","U18m",13,"U15m","U15w"]
[null,"NW","BVNW Landesmeisterschaft","KB","U18w",14,"U15m","U15w"]
[null,"NW & NI",null,null,"Damen",15,"U15m","U15w"]
[null,"NI & NW & SH",null,null,"Herren",16,"U18m","U18w"]
[{"$nulls":4},"Damen Ü50",17,"U18m","U18w"]
[{"$nulls":4},"Herren Ü50",18,"U18m","U18w"]
[{"$nulls":4},"Damen Ü65",19,"Herren","Damen"]
[{"$nulls":4},"Herren Ü65",20,"Herren","Damen"]
[{"$nulls":5},21,"Herren","Damen"]
[{"$nulls":5},22,"Herren","Damen"]
[{"$nulls":5},23,"Herren","Damen"]
[{"$nulls":5},24,"Herren","Damen"]
[{"$nulls":5},25,"Herren","Damen"]
[{"$nulls":5},26,"Herren","Damen"]
[{"$nulls":5},27,"Herren","Damen"]
[{"$nulls":5},28,"Herren","Damen"]
[{"$nulls":5},29,"Herren","Damen"]
[{"$nulls":5},30,"Herren","Damen"]
[{"$nulls":5},31,"Herren","Damen"]
[{"$nulls":5},32,"Herren","Damen"]
[{"$nulls":5},33,"Herren","Damen"]
[{"$nulls":5},34,"Herren","Damen"]
[{"$nulls":5},35,"Herren","Damen"]
[{"$nulls":5},36,"Herren","Damen"]
[{"$nulls":5},37,"Herren","Damen"]
[{"$nulls":5},38,"Herren","Damen"]
[{"$nulls":5},39,"Herren","Damen"]
[{"$nulls":5},40,"Herren","Damen"]
[{"$nulls":5},41,"Herren","Damen"]
[{"$nulls":5},42,"Herren","Damen"]
[{"$nulls":5},43,"Herren","Damen"]
[{"$nulls":5},44,"Herren","Damen"]
[{"$nulls":5},45,"Herren","Damen"]
[{"$nulls":5},46,"Herren","Damen"]
[{"$nulls":5},47,"Herren","Damen"]
[{"$nulls":5},48,"Herren","Damen"]
[{"$nulls":5},49,"Herren","Damen"]
[{"$nulls":5},50,"Herren","Damen"]
[{"$nulls":5},51,"Herren Ü50","Damen Ü50"]
[{"$nulls":5},52,"Herren Ü50","Damen Ü50"]
[{"$nulls":5},53,"Herren Ü50","Damen Ü50"]
[{"$nulls":5},54,"Herren Ü50","Damen Ü50"]
[{"$nulls":5},55,"Herren Ü50","Damen Ü50"]
[{"$nulls":5},56,"Herren Ü50","Damen Ü50"]
[{"$nulls":5},57,"Herren Ü50","Damen Ü50"]
[{"$nulls":5},58,"Herren Ü50","Damen Ü50"]
[{"$nulls":5},59,"Herren Ü50","Damen Ü50"]
[{"$nulls":5},60,"Herren Ü50","Damen Ü50"]
[{"$nulls":5},61,"Herren Ü50","Damen Ü50"]
[{"$nulls":5},62,"Herren Ü50","Damen Ü50"]
[{"$nulls":5},63,"Herren Ü50","Damen Ü50"]
[{"$nulls":5},64,"Herren Ü50","Damen Ü50"]
[{"$nulls":5},65,"Herren Ü50","Damen Ü50"]
[{"$nulls":5},66,"Herren Ü65","Damen Ü65"]
[{"$nulls":5},67,"Herren Ü65","Damen Ü65"]
[{"$nulls":5},68,"Herren Ü65","Damen Ü65"]
[{"$nulls":5},69,"Herren Ü65","Damen Ü65"]
[{"$nulls":5},70,"Herren Ü65","Damen Ü65"]
[{"$nulls":5},71,"Herren Ü65","Damen Ü65"]
[{"$nulls":5},72,"Herren Ü65","Damen Ü65"]
[{"$nulls":5},73,"Herren Ü65","Damen Ü65"]
[{"$nulls":5},74,"Herren Ü65","Damen Ü65"]
[{"$nulls":5},75,"Herren Ü65","Damen Ü65"]
[{"$nulls":5},76,"Herren Ü65","Damen Ü65"]
[{"$nulls":5},77,"Herren Ü65","Damen Ü65"]
[{"$nulls":5},78,"Herren Ü65","Damen Ü65"]
[{"$nulls":5},79,"Herren Ü65","Damen Ü65"]
[{"$nulls":5},80,"Herren Ü65","Damen Ü65"]
[{"$nulls":5},81,"Herren Ü65","Damen Ü65"]
[{"$nulls":5},82,"Herren Ü65","Damen Ü65"]
[{"$nulls":5},83,"Herren Ü65","Damen Ü65"]
[{"$nulls":5},84,"Herren Ü65","Damen Ü65"]
[{"$nulls":5},85,"Herren Ü65","Damen Ü65"]
[{"$nulls":5},86,"Herren Ü65","Damen Ü65"]
[{"$nulls":5},87,"Herren Ü65","Damen Ü65"]
[{"$nulls":5},88,"Herren Ü65","Damen Ü65"]
[{"$nulls":5},89,"Herren Ü65","Damen Ü65"]
[{"$nulls":5},90,"Herren Ü65","Damen Ü65"]
[{"$nulls":5},91,"Herren Ü65","Damen Ü65"]
[{"$nulls":5},92,"Herren Ü65","Damen Ü65"]
[{"$nulls":5},93,"Herren Ü65","Damen Ü65"]
[{"$nulls":5},94,"Herren Ü65","Damen Ü65"]
[{"$nulls":5},95,"Herren Ü65","Damen Ü65"]
[{"$nulls":5},96,"Herren Ü65","Damen Ü65"]
[{"$nulls":5},97,"Herren Ü65","Damen Ü65"]
[{"$nulls":5},98,"Herren Ü65","Damen Ü65"]
[{"$nulls":5},99,"Herren Ü65","Damen Ü65"]
[{"$nulls":5},100,"Herren Ü65","Damen Ü65"]